maasait
type: Concept
source: Kielitoimiston sanakirja
source: Källa: Nationalencyklopedin
broader generic: afrikkalaiset
comment: eräs Keniassa ja Tansaniassa elävä paimentolaisheimo
alternative label: massait
alternative label: maasai @sv
alternative label: masait
broader: afrikkalaiset
in scheme: conceptscheme
note: Kirjoitusmuoto tarkistettu Aasian ja Afrikan kielten ja kulttuurien laitokselta (Harri Halen). Kielitoimisto ei osannut sanoa, mikä on oikea kirjoitusmuoto
preferred label: massajer @sv
preferred label: Maasai people @en

afrikkalaiset
type: Concept
narrower: maasait
preferred label: Africans @en
preferred label: afrikaner @sv