carbon balance
type: Concept
broader generic: balance sheets
comment: Hiilitase käsitteenä kuvaa metsään sitoutuvan ja siitä vapautuvan hiilimäärän erotusta.
broader: balance sheets
in scheme: conceptscheme
preferred label: hiilitase @fi
preferred label: kolbalans @sv

balance sheets
type: Concept
narrower: carbon balance
preferred label: balansräkning @sv
preferred label: taseet @fi