rabbiner
type: Concept
source: Kielitoimiston sanakirja
broader generic: religionsrelaterad roll
comment: juut. lainoppineiden ja opettajien arvonimi
broader: religionsrelaterad roll
in scheme: conceptscheme
preferred label: rabbis @en
preferred label: rabbit @fi

religionsrelaterad roll
type: Concept
narrower: rabbiner
preferred label: role related to religion @en
preferred label: uskontoon liittyvä rooli @fi