Villa Rulludd
type: Concept
broader generic: buildings
comment: Alfred Kihlmanin vuonna 1873 rakennuttama huvila Espoon Suomenojalla
broader: buildings
in scheme: conceptscheme

buildings
type: Concept
narrower: Villa Rulludd
preferred label: rakennukset @fi
preferred label: byggnader @sv