absurd
type: Concept
source: Kielitoimiston sanakirja
broader generic: internal qualities
comment: mieletön, järjetön, järjenvastainen, mahdoton
broader: internal qualities
in scheme: conceptscheme
preferred label: absurditet @sv
preferred label: absurdi @fi

internal qualities
type: Concept
narrower: absurd
preferred label: inre egenskaper @sv
preferred label: sisäiset ominaisuudet @fi