stanolit
type: Concept
broader generic: sterolit
comment: Stanolit ovat tyydyttyneitä steroleja eli niiden sterolirenkaassa ei ole kaksoissidoksia.
broader: sterolit
in scheme: conceptscheme
preferred label: stanoler @sv
preferred label: stanols @en

sterolit
type: Concept
narrower: stanolit
preferred label: sterols @en
preferred label: steroler @sv