röda vinbär
type: Concept
source: Finfood
broader generic: herukat
comment: Punaherukkaa (Ribes rubrum) esiintyy luonnonvaraisena koko Suomessa. Viljellyt punaherukkalajikkeet ovat puolestaan syntyneet kolmen lajin, alppi-, pohjan- ja lännenpunaherukkoitten, risteytyksenä.
broader: herukat
in scheme: conceptscheme
preferred label: redcurrant @en
preferred label: punaherukka @fi

herukat
type: Concept
narrower: röda vinbär
preferred label: currants @en