reservaatit
type: Concept
source: Kielitoimiston sanakirja
broader generic: ihmisen määrittämät alueet
comment: luonnonsuojelu-, rauhoitusalue; vähemmistökansan t. heimon erillinen rauhoitettu asuma-alue
broader: ihmisen määrittämät alueet
in scheme: conceptscheme
preferred label: reservat @sv
preferred label: reservations, districts @en

ihmisen määrittämät alueet
type: Concept
narrower: reservaatit
preferred label: områden definierade genom människans aktivitet @sv
preferred label: areas defined by human @en