gravure printing
type: Concept
preferred label: djuptryck @sv
preferred label: syväpaino @fi
related: copper engraving

copper engraving
type: Concept
source: Kielitoimiston sanakirja
broader generic: graphics
comment: kaiverretusta (t. syövytetystä) kuparilaatasta vedostettu piirros, kuparikaiverros, vaskipiirros
broader: graphics
in scheme: conceptscheme
preferred label: kopparstick @sv
preferred label: kuparipiirros @fi
related: gravure printing

graphics
type: Concept
narrower: copper engraving
preferred label: grafik @sv
preferred label: grafiikka @fi