leimaus
type: Concept
source: Suomen kielen perussanakirja
broader generic: toisenlaiseksi muuttaminen
comment: lyödä, painaa tai muuten tehdä johonkin leima tai leimoja
alternative label: leimaaminen
alternative label: marking @en
broader: toisenlaiseksi muuttaminen
in scheme: conceptscheme
preferred label: stamping @en
preferred label: stämpling @sv

toisenlaiseksi muuttaminen
type: Concept
narrower: leimaus
preferred label: förvandling @sv
preferred label: alteration @en