tone systems
type: Concept
narrower: keys, music
preferred label: säveljärjestelmät @fi
preferred label: tonsystem @sv

keys, music
type: Concept
source: Kielitoimiston sanakirja
broader generic: tone systems
comment: mus. niiden sävelten järjestelmä, jotka ovat määräsuhteissa tiettyyn perussäveleen
broader: tone systems
in scheme: conceptscheme
preferred label: sävellajit @fi
preferred label: tonarter @sv