språkprov (exempel)
type: Concept
preferred label: language samples @en
preferred label: kielennäytteet @fi
related: prov (exempel)

prov (exempel)
type: Concept
source: Suomen kielen perussanakirja
broader generic: konkret icke-levande objekt
comment: suoritus, valmiste tms., joka osoittaa tai on tarkoitettu osoittamaan jonkun taitoa, jonkin tekotapaa tms., esimerkki, todiste, osoitus, näyttö
broader: konkret icke-levande objekt
in scheme: conceptscheme
preferred label: samples @en
preferred label: näytteet @fi
related: språkprov (exempel)

konkret icke-levande objekt
type: Concept
narrower: prov (exempel)
preferred label: concrete inanimate object @en
preferred label: konkreettinen eloton objekti @fi