tejpning
type: Concept
source: Suomen kielen perussanakirja
broader generic: placerande skapande
comment: 1) kiinnittää, sitoa, sulkea, peittää; 2) urheilu- yms. vammojen hoidossa ja ehkäisyssä: sitoa tiukasti teipin tapaisella siteellä
broader: placerande skapande
in scheme: conceptscheme
preferred label: teippaus @fi
preferred label: taping @en

placerande skapande
type: Concept
narrower: tejpning
preferred label: creation by placing @en
preferred label: paikalleen laittava luonti @fi