syntetismi
type: Concept
source: http://www.nikkemedia.fi/ivailu/nettikurssit/taidehistoria1/symbolismi.html
broader generic: tyylit (ilmiöt)
comment: väripinnat olivat puhtaita, litteitä ja ääriviivoin korostettuja, samalla kun syvyysvaikutelma oli niukkaa tai täysin olematonta. Tyyli tunnetaan nimellä syntetismi.
broader: tyylit (ilmiöt)
in scheme: conceptscheme
preferred label: synthetism @en
preferred label: syntetism @sv

tyylit (ilmiöt)
type: Concept
narrower: syntetismi
preferred label: styles @en
preferred label: stilar @sv