file formats
type: Concept
preferred label: filformat @sv
preferred label: tiedostomuodot @fi
related: formats

formats
type: Concept
broader generic: cultural accomplishments
comment: televisio- t. radio-ohjelman tms. tietynlaiseksi suunniteltu muoto (Kielitoimiston sanakirja)
broader: cultural accomplishments
in scheme: conceptscheme
preferred label: format @sv
preferred label: formaatit @fi
related: file formats

cultural accomplishments
type: Concept
narrower: formats
preferred label: kulturella alster @sv
preferred label: kulttuuriset tuotokset @fi