servitut
type: Concept
source: Kielitoimiston sanakirja
broader generic: rättstekniska fenomen
comment: oikeus käyttää toisen kiinteistön aluetta määrätarkoitukseen
broader: rättstekniska fenomen
in scheme: conceptscheme
preferred label: easements @en
preferred label: rasitteet @fi

rättstekniska fenomen
type: Concept
narrower: servitut
preferred label: oikeustekniset ilmiöt @fi
preferred label: technical-legal phenomena @en