satellitnavigering
type: Concept
source: Paikannussanasto TSK 30
broader generic: positionsbestämning
comment: satelliittien lähettämiin radiosignaaleihin perustuva paikannus
alternative label: GPS
broader: positionsbestämning
in scheme: conceptscheme
preferred label: satelliittipaikannus @fi
preferred label: satellite radiodetermination @en

positionsbestämning
type: Concept
narrower: satellitnavigering
preferred label: locationing @en
preferred label: paikannus @fi