arvsordning
type: Concept
source: Kielitoimiston sanakirja
broader generic: rättstekniska fenomen
comment: oik. se järjestys, jossa kullakin on oikeus perintöön
broader: rättstekniska fenomen
in scheme: conceptscheme
preferred label: canon of descent @en
preferred label: perimysjärjestys @fi

rättstekniska fenomen
type: Concept
narrower: arvsordning
preferred label: oikeustekniset ilmiöt @fi
preferred label: technical-legal phenomena @en