groteski (kirjasin)
type: Concept
source: Kielitoimiston sanakirja
broader generic: kirjasin
comment: kirjap. jäykkäpiirteinen, tasapaksu kirjaintyyli
alternative label: groteski
broader: kirjasin
in scheme: conceptscheme
preferred label: grotesk (typ) @sv
preferred label: grotesque (font) @en

kirjasin
type: Concept
narrower: groteski (kirjasin)
preferred label: trycktyp @sv
preferred label: font @en