transfer of money
type: Concept
narrower: clearing system
preferred label: penningöverföring @sv
preferred label: rahavarojen siirtäminen @fi

clearing system
type: Concept
source: Suomen kielen perussanakirja
broader generic: transfer of money
comment: rahalaitosten keskinäisselvitys, jolla tasataan pankkien väliset velat ja saatavat
broader: transfer of money
in scheme: conceptscheme
preferred label: clearing @sv