ubikinon
type: Concept
broader generic: kemiska föreningar
comment: Ubikinoni (koentsyymi Q10, CoQ10) on rasvaliukoinen, vitamiinin tapainen yhdiste, joka esiintyy elimistön kaikissa soluissa. Sitä on pieniä määriä monissa elintarvikkeissa ja erityisesti sisäelimissä (sydän, maksa ja munuaiset), lihassa, soijaöljyssä, sardiineissa, makrillissa ja maapähkinöissä. Lisäksi sitä muodostuu jatkuvasti elimistössä maksan toimesta.
broader: kemiska föreningar
in scheme: conceptscheme
preferred label: ubikinoni @fi
preferred label: ubiquinone @en

kemiska föreningar
type: Concept
narrower: ubikinon
preferred label: chemical compounds @en
preferred label: kemialliset yhdisteet @fi