studentnationer
type: Concept
source: Kielitoimiston sanakirja
broader generic: studentorganisationer
comment: samasta maakunnasta kotoisin olevien yliopiston opiskelijoiden yhdistys
broader: studentorganisationer
in scheme: conceptscheme
preferred label: students' clubs @en
preferred label: osakunnat @fi

studentorganisationer
type: Concept
narrower: studentnationer
preferred label: student organisations @en
preferred label: opiskelijajärjestöt @fi