Gopher
type: Concept
source: Atk-sanakirja
broader generic: tekniska system
comment: Internet-verkossa WWW:tä edeltänyt tekstidokumenttien haku- ja saantikäytäntö
broader: tekniska system
in scheme: conceptscheme

tekniska system
type: Concept
narrower: Gopher
preferred label: technical systems @en
preferred label: tekniset järjestelmät @fi