paikkatiedot
type: Concept
source: Paikannussanasto TSK 30
broader generic: tieto
comment: paikannettua kohdetta kuvaavan sijaintitiedon ja kohteen ominaisuuksia kuvaavien tietojen muodostama kokonaisuus
broader: tieto
in scheme: conceptscheme
preferred label: geografisk information @sv
preferred label: geographic information @en

tieto
type: Concept
narrower: paikkatiedot
preferred label: data @en