kielelliset ilmiöt
type: Concept
narrower: ellipsit (kielelliset ilmiöt)
preferred label: språkliga fenomen @sv
preferred label: linguistic phenomena @en

ellipsit (kielelliset ilmiöt)
type: Concept
source: Kielitoimiston sanakirja
broader generic: kielelliset ilmiöt
comment: sanan t. sanojen pois jääminen ilmauksesta merkityksen silti muuttumatta
alternative label: ellipsit
broader: kielelliset ilmiöt
in scheme: conceptscheme
preferred label: ellipser (språkliga fenomen) @sv
preferred label: ellipses @en