occupations
type: Concept
narrower: governors
preferred label: yrken @sv
preferred label: ammatit @fi

governors
type: Concept
source: Kielitoimiston sanakirja
broader generic: occupations
comment: suurehkon alueen ylin hallintoviranomainen eräissä maissa; hist. Suomessa maaherraa vastannut virkamies
broader: occupations
in scheme: conceptscheme
preferred label: kuvernöörit @fi
preferred label: guvernörer @sv