tactics
type: Concept
source: Suomen kielen perussanakirja
broader generic: societal accomplishments
comment: 1) (sot.) tapa käyttää joukkoja ja taisteluvälineitä taistelun päämäärän saavuttamiseksi; taistelutaito; 2) suunnitelmallinen menettely, strategia
broader: societal accomplishments
in scheme: conceptscheme
preferred label: taktiikka @fi
preferred label: taktik @sv
related: strategies

strategies
type: Concept
preferred label: strategi @sv
preferred label: strategia @fi
related: tactics

societal accomplishments
type: Concept
narrower: tactics
preferred label: samhälleliga alster @sv
preferred label: yhteiskunnalliset tuotokset @fi