popular tradition
type: Concept
preferred label: folktradition @sv
preferred label: kansanperinne @fi
related: folklorism

ideas
type: Concept
narrower: folklorism
preferred label: tankar (idéer) @sv
preferred label: aatteet @fi

folklorism
type: Concept
broader generic: ideas
comment: FOLKLORISMI on perinteen soveltamista, jossa tietoisesti käyttää hyväkseen perinteen elementtejä kaupallisiin, kansallisiin, matkailullisiin, ideologisiin tai viihteellisiin tarkoituksiin. Ilmiö sai alkunsa esiromantiikan aikana ja sen perusedellytyksenä oli ihannoiva ja sentimentaalinen suhtautuminen perinteeseen. Myöhemmin folklorismia ei niinkään ruokkinut romantiikka tai tietoisuus kansallisen kulttuurin arvoista kuin tieteellis-tekninen kehitys, teollistuminen ja siihen liittyvä urbaanistuminen. [Perinteentutkimuksen terminologia]
broader: ideas
in scheme: conceptscheme
preferred label: folklorismi @fi
related: popular tradition