teoriat
type: Concept
narrower: behaviorismi
preferred label: theories @en
preferred label: teori @sv

behaviorismi
type: Concept
source: Kielitoimiston sanakirja
broader generic: teoriat
comment: psyk. vain ulkoisesti havaittavaa käyttäytymistä tutkiva psykologian suunta
broader: teoriat
in scheme: conceptscheme
preferred label: behaviorism @sv