uppvärmning med värmeelement
type: Concept
preferred label: patterilämmitys @fi
preferred label: radiator heating @en
related: värmeelement (värmeapparater)

värmeelement (värmeapparater)
type: Concept
source: Energiasanasto TSK 16
broader generic: värmeutrustning
comment: vesikeskuslämmitysjärjestelmään kuuluvaa huonetilan lämmittimenä käytettäväa lämmönvaihdinta ulkomuodoltaan muistuttava sähkölämmitin
alternative label: värmeelement
alternative label: lämpöpatterit @fi
alternative label: radiatorer
broader: värmeutrustning
in scheme: conceptscheme
preferred label: lämpöpatterit (lämmityslaitteet) @fi
preferred label: radiators @en
related: uppvärmning med värmeelement

värmeutrustning
type: Concept
narrower: värmeelement (värmeapparater)
preferred label: heating equipment @en
preferred label: lämmityslaitteet @fi