organs
type: Concept
narrower: wrists
preferred label: elimet @fi
preferred label: organ @sv

wrists
type: Concept
source: MOT Lääketiede 2.0a
broader generic: organs
broader partitive: hands
comment: kyynärvarren ja kämmenen välinen yläraajan osa, joka on muodostunut kahdeksasta ranneluusta ja niihin liittyvistä pehmeistä kudoksista
broader: hands
broader: organs
in scheme: conceptscheme
preferred label: ranteet @fi
preferred label: handlederna @sv

hands
type: Concept
narrower: wrists
preferred label: händer, armar @sv
preferred label: kädet @fi