ellipsit (geometriset kuviot)
type: Concept
source: Kielitoimiston sanakirja
broader generic: geometriset kuviot
comment: litistyneen ympyrän muotoinen tasokäyrä, soikio
alternative label: ellipsit
broader: geometriset kuviot
in scheme: conceptscheme
preferred label: ellipses @en
preferred label: ellipser (geometriska figurer) @sv

geometriset kuviot
type: Concept
narrower: ellipsit (geometriset kuviot)
preferred label: geometric shapes @en
preferred label: geometriska figurer @sv