muu rooli
type: Concept
narrower: sovellukset
preferred label: annan roll @sv
preferred label: other role @en

soveltaminen
type: Concept
preferred label: tillämpande @sv
preferred label: application @en
related: sovellukset

sovellukset
type: Concept
source: Kielitoimiston sanakirja
broader generic: muu rooli
comment: 1) soveltamisen tulos t. kohde; 2) (atk) tiettyä tehtävää t. tiettyjä tehtäviä toteuttamaan tarkoitettu ohjelma, joka ei liity kiinteästi järjestelmän ylläpitoon t. hallintaan
broader: muu rooli
in scheme: conceptscheme
preferred label: applications @en
preferred label: tillämpningar @sv
related: soveltaminen