sosiaalinen konstruktivismi
type: Concept
broader generic: konstruktivismi
broader: konstruktivismi
preferred label: social constructivism @en
preferred label: social konstruktivism @sv

aatteet
type: Concept
narrower: konstruktivismi
preferred label: tankar (idéer) @sv
preferred label: ideas @en

konstruktivismi
type: Concept
source: http://wwwedu.oulu.fi/okl/lo/kt2/wkonstr.htm
broader generic: aatteet
comment: Konstruktivismi perustuu käsitykselle oppijasta aktiivisena tiedon muokkaajana sekä käsitykselle itse tiedon dynaamisuudesta. Konstruktivistisen käsityksen mukaan tietoa ei voida sellaisenaan välittää oppijalle, vaan oppija on aktiivinen tiedon konstruoija eli tietorakenteiden muodostaja oppimisprosessissa.
alternative label: konstruktionismi
broader: aatteet
in scheme: conceptscheme
narrower: sosiaalinen konstruktivismi
preferred label: constructivism @en
preferred label: konstruktivism @sv