proteiner
type: Concept
narrower: kollagen
preferred label: proteins @en
preferred label: valkuaisaineet @fi

kollagen
type: Concept
source: Biologian sanakirja
broader generic: proteiner
comment: elimistön tukiproteiini, jota on sidekudoksen ja ruston sekä niistä syntyneiden kudosten, kuten jänteiden ja luiden, väliaineessa
broader: proteiner
in scheme: conceptscheme
preferred label: kollageenit @fi
preferred label: collagens @en