menetelmät
type: Concept
narrower: fysiognomia (menetelmät)
preferred label: metoder @sv
preferred label: methods @en

fysiognomia (menetelmät)
type: Concept
source: WebFacta
broader generic: menetelmät
comment: kasvillisuustutkimus, jossa kasvillisuuden luokittelun pääperusteina ovat valtalajien yleismorfologiaan perustuvat kasvumuodot
alternative label: fysionomia
alternative label: fysiognomia
broader: menetelmät
in scheme: conceptscheme
preferred label: fysiognomi (metoder) @sv
preferred label: physiognomy @en