concrete inanimate object
type: Concept
narrower: frames
preferred label: konkret icke-levande objekt @sv
preferred label: konkreettinen eloton objekti @fi

frames
type: Concept
source: Suomen kielen perussanakirja
broader generic: concrete inanimate object
comment: 1) taulun tms. (koriste)lista, raami; 2) puitteet, "pokat"; vanne tms., johon jotakin pingotetaan: kehikko, ulkorunko
broader: concrete inanimate object
in scheme: conceptscheme
preferred label: ramar @sv
preferred label: kehykset @fi
related: framing

framing
type: Concept
preferred label: inramning @sv
preferred label: kehystys @fi
related: frames