koko
type: Concept
narrower: kaanonit (koko)
preferred label: size @en
preferred label: storlek @sv

kaanonit (koko)
type: Concept
source: Lähde: Suomen kielen perussanakirja; CD-Facta
broader generic: koko
comment: kirjapainoalalla eräs iso kirjasinkoko; Kirjapainomaailmassa kaanon kuitenkin on tarkoittanut 36 pisteen kirjasinta. Nimi toki juontuu Raamatun ns. kanonisista kirjoista
alternative label: kanonit
alternative label: kaanonit
broader: koko
in scheme: conceptscheme
note: Termen har många betydelser. Den används för 1) samling av heliga skrifter 2) musikstycke 3) stor tryckstil 4) centrala verk inom kultur eller konst t.ex. i ett visst land . För artilleripjäs används kanoner. @sv
note: Sanalla on monia merkityksiä. 1) Uskonnossa kaanon voi olla pyhien kirjojen kokoelma, kirkolliskokouksen tai paavin säädös, katolisen kirkon pyhimysluettelo tai ortodoksinen liturginen runoelma. 2) Kuvataiteissa ihmisruumiin ihanteellisten mittasuhteiden säännöt. 3) Musiikissa moniääninen sävellysmuoto, jossa sama teema alkaa uudessa äänessä ennen kuin se on päättynyt toisessa. 4) Kirjallisuudenhistoriassa yleisesti hyväksytyt teokset. 5) Kirjapainoalalla eräs iso kirjasinkoko
preferred label: canons @en
preferred label: kanon (storlek) @sv