ilmalämmitys
comment: keskuslämmitys, jossa lämmönsiirtoaineena on ilma
alternative label: kuumailmalämmitys
alternative label: varmluftsuppvärmning @sv
source: Energiasanasto TSK 16
broader generic: keskuslämmitys
preferred label: luftuppvärmning @sv
preferred label: air heating @en
type: Concept
in scheme: conceptscheme
broader: keskuslämmitys

keskuslämmitys
preferred label: centralvärme @sv
preferred label: central heating @en
type: Concept
narrower: ilmalämmitys