arvonimet
preferred label: honorary titles @en
preferred label: hederstitlar @sv
type: Concept
narrower: opetusneuvokset (arvonimet)

opetusneuvokset (arvonimet)
comment: In singular 'opetusneuvos', in plural 'opetusneuvokset'.
preferred label: undervisningsråd (titlar) @sv
preferred label: opetusneuvokset (honorary titles) @en
in scheme: conceptscheme
broader generic: arvonimet
type: Concept
alternative label: opetusneuvokset
broader: arvonimet