hyväksyminen (kelpuuttaminen)
preferred label: acceptance @en
preferred label: godkännande @sv
comment: pitää jotakin sopivana, kelvollisena, oikeana; katsoa hyväksi, kelpuuttaa; suostua tai myöntyä johonkin, suhtautua johonkin suopeasti
broader generic: kognitio
source: Suomen kielen perussanakirja
alternative label: hyväksyminen
alternative label: hyväksyntä
type: Concept
broader: kognitio
in scheme: conceptscheme

kognitio
preferred label: kognition @sv
preferred label: cognition @en
type: Concept
narrower: hyväksyminen (kelpuuttaminen)