växternas beståndsdelar
preferred label: parts of plants @en
preferred label: kasvinosat @fi
type: Concept
narrower: stjälk

stjälk
preferred label: stem (parts of plants) @en
preferred label: varsi (kasvinosat) @fi
source: Kielitoimiston sanakirja
comment: kasvin t. verson rankaosa, johon lehdet ovat kiinnittyneet
broader: växternas beståndsdelar
in scheme: conceptscheme
broader generic: växternas beståndsdelar
type: Concept