morer
comment: 1. hist. Maurit muinaisen Mauretanian asukkaat; (keskiajalla) pohjoisafrikkalaiset islaminuskoiset Espanjan valloittajat.; 2. vanh. Luoteis-Afrikan arabien, berberien ja mustien muodostaman islaminuskoisen väestön jäsen.
preferred label: maurit @fi
preferred label: Moors @en
type: Concept
broader generic: roll i anslutning till befolkningsgrupp
in scheme: conceptscheme
source: Kielitoimiston sanakirja
broader: roll i anslutning till befolkningsgrupp

roll i anslutning till befolkningsgrupp
preferred label: role related to population group @en
preferred label: väestöryhmään liittyvä rooli @fi
type: Concept
narrower: morer