autonomian aika
preferred label: era of autonomy, history of finland @en
preferred label: autonoma tiden @sv
type: Concept
related: perustuslailliset

perustuslailliset
preferred label: konstitutionella @sv
type: Concept
in scheme: conceptscheme
comment: perustuslaillisen hallitusmuodon kannattaja, Suomessa vars. 1899 alkaneen ensimmäisen sortokauden aikaisista passiivisen vastarinnan kannattajista
source: Kielitoimiston sanakirja
broader generic: aatteelliseen ryhmään liittyvä rooli
related: autonomian aika
broader: aatteelliseen ryhmään liittyvä rooli

aatteelliseen ryhmään liittyvä rooli
preferred label: role related to ideological group @en
preferred label: roll i anslutning till ideologisk grupp @sv
type: Concept
narrower: perustuslailliset