lehtorit (kirkon työntekijät)
broader: kirkon työntekijät
preferred label: lecturers @en
preferred label: lektorer (kyrkligt anställda) @sv
in scheme: conceptscheme
comment: lut. seurakunnan palveluksessa oleva naisteologi, jota ei ole vihitty papiksi.
alternative label: lehtorit
source: Kielitoimiston sanakirja
broader generic: kirkon työntekijät
type: Concept

kirkon työntekijät
preferred label: church employees @en
preferred label: kyrkans arbetstagare @sv
type: Concept
narrower: lehtorit (kirkon työntekijät)