skenbenet
broader: skelettet
broader: rörelseorgan
comment: säären kahdesta luusta paksumpi ja lähes koko kuorman kantava luu, joka niveltyy yläpäästään reisiluuhun ja alapäästään telaluuhun
broader partitive: skelettet
type: Concept
broader generic: rörelseorgan
in scheme: conceptscheme
preferred label: sääriluu @fi
preferred label: tibia @en
source: MOT Lääketiede 2.0a

skelettet
preferred label: skeleton @en
preferred label: luusto @fi
type: Concept
narrower: skenbenet

rörelseorgan
preferred label: musculoskeletal system @en
preferred label: tuki- ja liikuntaelimet @fi
type: Concept
narrower: skenbenet