samhälleliga system
preferred label: societal systems @en
preferred label: yhteiskunnalliset järjestelmät @fi
type: Concept
narrower: distributionskanaler

distributionskanaler
in scheme: conceptscheme
source: Logistiikan peruskurssi
preferred label: jakelutiet @fi
preferred label: distribution channels @en
alternative label: jakelukanavat @fi
alternative label: distributionsvägar
comment: jakelutie (jakelukanava, markkinointikanava): Kaikkien niiden yritysten muodostama ketju, jotka osallistuvat määrätyn tuotteen siirtoon valmistuspisteestä lopulliselle kuluttajalle.
related: logistik
type: Concept
broader: samhälleliga system
broader generic: samhälleliga system

logistik
preferred label: logistics @en
preferred label: logistiikka @fi
type: Concept
related: distributionskanaler