förvandling
preferred label: alteration @en
preferred label: toisenlaiseksi muuttaminen @fi
type: Concept
narrower: sammanförande

sammanförande
preferred label: consolidation @en
preferred label: yhdistäminen @fi
comment: 1) kiinnittää esineet tms. toisiinsa, liittää, kytkeä 2) saattaa yhtenäiseksi kokonaisuudeksi 3) sijoittaa johonkin kokonaisuuteen tai yhteyteen, liittää, kytkeä, niveltää [Suomen kielen perussanakirja]
broader generic: förvandling
broader: förvandling
type: Concept
in scheme: conceptscheme
related: förenande

förenande
preferred label: unification @en
preferred label: yhdistyminen @fi
type: Concept
related: sammanförande