illusionismi (aatteet)
type: Concept
broader: aatteet
alternative label: illusionismi
in scheme: conceptscheme
preferred label: illusionism (ideas) @en
preferred label: illusionism (idéer) @sv
comment: fil. näkemys, jonka mukaan todellisuus on kuvittelua, illuusiota
broader generic: aatteet
source: Kielitoimiston sanakirja

aatteet
preferred label: tankar (idéer) @sv
preferred label: ideas @en
type: Concept
narrower: illusionismi (aatteet)