place created by nature
preferred label: naturformad plats @sv
preferred label: luonnon muodostama paikka @fi
type: Concept
narrower: potholes

potholes
type: Concept
broader generic: place created by nature
broader: place created by nature
preferred label: hiidenkirnut @fi
preferred label: jättegrytor @sv
alternative label: giant's cauldrons
in scheme: conceptscheme
comment: vesipyörteen pyörittämän kiven kallioon t. irtokiveen kovertama lieriömäinen syvennys
source: Kielitoimiston sanakirja